Learn what Felgo offers to help your business succeed. Start your free evaluation today! Felgo for Your Business

Forums

OverviewFelgo 2 Support (Qt 5) › Felgo server problem?

Tagged: 

Viewing 2 posts - 1 through 2 (of 2 total)
  • Author
    Posts
  • #22369

    Nicola

    Hi,

    from yesterday for every app that use facebook and onesignal plugin i have this:

    FAILURE: Build failed with an exception.

    * What went wrong:

    Could not resolve all files for configuration ‘:debugCompileClasspath’.

    > Could not resolve net.vplay.plugins:plugin-facebook:3.+.

    Required by:

    project :

    > Failed to list versions for net.vplay.plugins:plugin-facebook.

    > Unable to load Maven meta-data from https://sdk.v-play.net/maven/net/vplay/plugins/plugin-facebook/maven-metadata.xml.

    > Could not HEAD ‘https://sdk.v-play.net/maven/net/vplay/plugins/plugin-facebook/maven-metadata.xml’.

    > sun.security.validator.ValidatorException: PKIX path building failed: sun.security.provider.certpath.SunCertPathBuilderException: unable to find valid certification path to requested target

    > Could not resolve net.vplay.plugins:plugin-onesignal:3.+.

    Required by:

    project :

    > Failed to list versions for net.vplay.plugins:plugin-onesignal.

    > Unable to load Maven meta-data from https://sdk.v-play.net/maven/net/vplay/plugins/plugin-onesignal/maven-metadata.xml.

    > Could not HEAD ‘https://sdk.v-play.net/maven/net/vplay/plugins/plugin-onesignal/maven-metadata.xml’.

    > sun.security.validator.ValidatorException: PKIX path building failed: sun.security.provider.certpath.SunCertPathBuilderException: unable to find valid certification path to requested target

    * Try:

    Run with –stacktrace option to get the stack trace. Run with –info or –debug option to get more log output. Run with –scan to get full insights.

    * Get more help at https://help.gradle.org

    BUILD FAILED in 12s

    1 actionable task: 1 executed

    Building the android package failed!

    — For more information, run this command with –verbose.

    01:43:59: The process “/Users/nicola/V-PlaySDK/Felgo/android_armv7/bin/androiddeployqt” exited with code 14.

    Error while building/deploying project dabuttare2 (kit: Android for armeabi-v7a (Clang Qt 5.12.3 for Android ARMv7))

    When executing step “Build Android APK

     

    #22377

    Nicola

    Hi,

    i resolved adding the site cert to my key tool. I write what i do:

    1. Download the cert of the site with the browser
    2. reset my keytool password as reported here https://docs.oracle.com/cd/E19957-01/817-3331/6miuccqo3/index.html
    3. sudo keytool -import -alias felgo -keystore /Library/Java/JavaVirtualMachines/jdk1.8.0_66.jdk/Contents/Home/jre/lib/security/cacerts -file ~/Desktop/sdk_v-play_net.crt

    and now i can compile for android.

Viewing 2 posts - 1 through 2 (of 2 total)

RSS feed for this thread

You must be logged in to reply to this topic.

Qt_Technology_Partner_RGB_475 Qt_Service_Partner_RGB_475_padded